Reaction Details
TargetActivin receptor type-1
LigandBDBM161925
Substrate/Competitorn/a
Meas. Tech.ALK1-6 enzymatic assays
pH7.5±n/a
IC50 28±n/a nM
Commentsextracted
Citation Alimardanov, ACuny, GDGrewal, GSLee, AMcKew, JCMohedas, AHShen, MXu, XYu, PB BMP inhibitors and methods of use thereof US Patent US9682983 Publication Date 6/20/2017
 
Activin receptor type-1
Name:Activin receptor type-1
Type:n/a
Mol. Mass.:57158.32
Organism:Homo sapiens (Human)
Description:n/a
Residue:509
BDBM161925
NameBDBM161925
Synonyms:US10017516, Compound 57 | US9682983, 57
TypeSmall organic molecule
Emp. Form.C29H30N6O
Mol. Mass.478.5881
SMILESCC(C)(CN1CCCCC1)Oc1ccc(nc1)-c1cnc2c(cnn2c1)-c1cccc2ncccc12