Reaction Details
TargetBone morphogenetic protein receptor type-1B
LigandBDBM161930
Substrate/Competitorn/a
Meas. Tech.ALK1-6 enzymatic assays
pH7.5±n/a
IC50 1854±n/a nM
Commentsextracted
Citation Alimardanov, ACuny, GDGrewal, GSLee, AMcKew, JCMohedas, AHShen, MXu, XYu, PB BMP inhibitors and methods of use thereof US Patent US9682983 Publication Date 6/20/2017
 
Bone morphogenetic protein receptor type-1B
Name:Bone morphogenetic protein receptor type-1B
Type:Enzyme
Mol. Mass.:56939.41
Organism:Homo sapiens (Human)
Description:O00238
Residue:502
BDBM161930
NameBDBM161930
Synonyms:US10017516, Compound 62 | US9682983, 62
TypeSmall organic molecule
Emp. Form.C26H24N6O
Mol. Mass.436.5084
SMILESCc1ccc2c(cccc2n1)-c1cnn2cc(cnc12)-c1ccc(OC2CCNCC2)cn1