Reaction Details
TargetBone morphogenetic protein receptor type-1A
LigandBDBM161933
Substrate/Competitorn/a
Meas. Tech.ALK1-6 enzymatic assays
pH7.5±n/a
IC50 3208±n/a nM
Commentsextracted
Citation Alimardanov, ACuny, GDGrewal, GSLee, AMcKew, JCMohedas, AHShen, MXu, XYu, PB BMP inhibitors and methods of use thereof US Patent US9682983 Publication Date 6/20/2017
 
Bone morphogenetic protein receptor type-1A
Name:Bone morphogenetic protein receptor type-1A
Type:Enzyme
Mol. Mass.:60204.46
Organism:Homo sapiens (Human)
Description:P36894
Residue:532
BDBM161933
NameBDBM161933
Synonyms:US10017516, Compound 65 | US9682983, 65
TypeSmall organic molecule
Emp. Form.C24H20N6O
Mol. Mass.408.4552
SMILESC1C[C@@H](CN1)Oc1ccc(nc1)-c1cnc2c(cnn2c1)-c1cccc2ncccc12