Reaction Details
TargetSodium/glucose cotransporter 2
LigandBDBM159516
Substrate/Competitorn/a
Meas. Tech.SGLT2 Inhibition Assay
pH7.4±n/a
Temperature310.15±n/a K
IC50 0.37±n/a nM
Commentsextracted
Citation Choi, SKim, JESong, KLee, SHPark, KSeo, HJKim, MJPark, EPark, SOKong, YKang, HSon, IJung, MECha, MKim, HJLee, JSKim, MLee, MWLee, K Method for dual inhibition of SGLT1 and SGLT2 using diphenylmethane derivatives US Patent US9340521 Publication Date 5/17/2016
 
Sodium/glucose cotransporter 2
Name:Sodium/glucose cotransporter 2
Type:Protein
Mol. Mass.:72902.00
Organism:Homo sapiens (Human)
Description:P31639
Residue:672
BDBM159516
NameBDBM159516
Synonyms:US9034921, E158 | US9340521, E024
TypeSmall organic molecule
Emp. Form.C23H25ClO7
Mol. Mass.448.893
SMILESOC[C@H]1O[C@H]([C@H](O)[C@@H](O)[C@@H]1O)c1cc(Cc2ccc(cc2)C2CC2)c(Cl)c2OCOc12