Reaction Details
TargetLegumain
LigandBDBM228617
Substrate/Competitorn/a
Meas. Tech.Inhibition Assay
pH5.8±n/a
IC50 704±n/a nM
Commentsextracted
Citation Lee, JYin, FBogyo, MSEdgington, LE Specific inhibitors and active site probes for legumain US Patent US9345789 Publication Date 5/24/2016
 
Legumain
Name:Legumain
Type:n/a
Mol. Mass.:49411.12
Organism:Homo sapiens (Human)
Description:n/a
Residue:433
BDBM228617
NameBDBM228617
Synonyms:US9345789, LI-0
TypeSmall organic molecule
Emp. Form.C21H26N2O7
Mol. Mass.418.4403
SMILESCC(=O)N1CCC[C@H]1C(=O)N[C@@H](CC(O)=O)C(=O)COC(=O)c1c(C)cccc1C