Reaction Details
TargetLeucine-rich repeat serine/threonine-protein kinase 2 [970-2527,I2020T]
LigandBDBM228657
Substrate/Competitorn/a
Meas. Tech.LRRK2 Kinase Assay
pH7.4±n/a
Temperature298.15±n/a K
IC50 1.4e+3± 2e+2 nM
Commentsextracted
Citation Ray, SBender, SKang, SLin, RGlicksman, MALiu, M The Parkinson disease-linked LRRK2 protein mutation I2020T stabilizes an active state conformation leading to increased kinase activity. J Biol Chem289:13042-53 (2014) 
 
Leucine-rich repeat serine/threonine-protein kinase 2 [970-2527,I2020T]
Name:Leucine-rich repeat serine/threonine-protein kinase 2 [970-2527,I2020T]
Type:n/a
Mol. Mass.:177305.51
Organism:Homo sapiens (Human)
Description:Q5S007[970-2527,I2020T]
Residue:1558
BDBM228657
NameBDBM228657
Synonyms:GSK3-XIII
TypeSmall organic molecule
Emp. Form.C18H15N5
Mol. Mass.301.3452
SMILESCc1cc(Nc2nc(nc3ccccc23)-c2ccccc2)n[nH]1