Reaction Details
TargetDNA-directed RNA polymerase subunit beta
LigandBDBM50391000
Substrate/Competitorn/a
Meas. Tech.RNAP-Inhibition Assay
Temperature310.15±n/a K
IC50 2e+1±n/a nM
Commentsextracted
Citation Walker, SSDegen, DNickbarg, ECarr, DSoriano, AMandal, MPainter, RESheth, PXiao, LSher, XMurgolo, NSu, JOlsen, DBEbright, RHYoung, K Affinity Selection-Mass Spectrometry Identifies a Novel Antibacterial RNA Polymerase Inhibitor. ACS Chem Biol12:1346-1352 (2017) 
 
DNA-directed RNA polymerase subunit beta
Name:DNA-directed RNA polymerase subunit beta
Type:Enzyme
Mol. Mass.:150595.80
Organism:Escherichia coli
Description:P0A8V2
Residue:1342
BDBM50391000
NameBDBM50391000
Synonyms:CB-01-11 | RIFAMYCIN
TypeSmall organic molecule
Emp. Form.C37H47NO12
Mol. Mass.697.7686
SMILESCO[C@H]1\C=C\O[C@@]2(C)Oc3c(C2=O)c2c(O)cc(NC(=O)\C(C)=C/C=C/[C@H](C)[C@H](O)[C@@H](C)[C@@H](O)[C@@H](C)[C@H](OC(C)=O)[C@@H]1C)c(O)c2c(O)c3C