Reaction Details
TargetDual specificity protein kinase TTK
LigandBDBM230894
Substrate/Competitorn/a
Meas. Tech.Kinase Assay
pH7±n/a
Temperature298.15±n/a K
IC50 2±n/a nM
Commentsextracted
Citation Hoelder, SBlagg, JCheung, KJAtrash, BSheldrake, P Pharmacologically active compounds US Patent US9334286 Publication Date 5/10/2016
 
Dual specificity protein kinase TTK
Name:Dual specificity protein kinase TTK
Type:Protein
Mol. Mass.:97086.79
Organism:Homo sapiens (Human)
Description:P33981
Residue:857
BDBM230894
NameBDBM230894
Synonyms:US10188642, Example 20 | US9334286, 20
TypeSmall organic molecule
Emp. Form.C26H26N6O
Mol. Mass.438.5242
SMILESCOc1cc(ccc1Nc1cc2cc(ccc2cn1)-c1cnn(C)c1C)-c1cnc(C)n1C