Reaction Details
TargetDual specificity protein kinase TTK
LigandBDBM230908
Substrate/Competitorn/a
Meas. Tech.Kinase Assay
pH7±n/a
Temperature298.15±n/a K
IC50 3±n/a nM
Commentsextracted
Citation Hoelder, SBlagg, JCheung, KJAtrash, BSheldrake, P Pharmacologically active compounds US Patent US9334286 Publication Date 5/10/2016
 
Dual specificity protein kinase TTK
Name:Dual specificity protein kinase TTK
Type:Protein
Mol. Mass.:97086.79
Organism:Homo sapiens (Human)
Description:P33981
Residue:857
BDBM230908
NameBDBM230908
Synonyms:US10188642, Example 34 | US9334286, 34
TypeSmall organic molecule
Emp. Form.C26H26N6O2
Mol. Mass.454.5236
SMILESCOc1cc(ccc1Nc1cc2cc(ccc2cn1)-c1cnn(C)c1CO)-c1cnc(C)n1C