Reaction Details
TargetDual specificity protein kinase TTK
LigandBDBM230916
Substrate/Competitorn/a
Meas. Tech.Kinase Assay
pH7±n/a
Temperature298.15±n/a K
IC50 3±n/a nM
Commentsextracted
Citation Hoelder, SBlagg, JCheung, KJAtrash, BSheldrake, P Pharmacologically active compounds US Patent US9334286 Publication Date 5/10/2016
 
Dual specificity protein kinase TTK
Name:Dual specificity protein kinase TTK
Type:Protein
Mol. Mass.:97086.79
Organism:Homo sapiens (Human)
Description:P33981
Residue:857
BDBM230916
NameBDBM230916
Synonyms:US10188642, Example 42 | US9334286, 42
TypeSmall organic molecule
Emp. Form.C27H27ClN6O
Mol. Mass.486.996
SMILESCc1ncc(-c2ccc(Nc3cc4cc(ccc4cn3)-c3cnn(CC(C)(C)O)c3)c(Cl)c2)n1C