Reaction Details
TargetDual specificity protein kinase TTK
LigandBDBM230924
Substrate/Competitorn/a
Meas. Tech.Kinase Assay
pH7±n/a
Temperature298.15±n/a K
IC50 2±n/a nM
Commentsextracted
Citation Hoelder, SBlagg, JCheung, KJAtrash, BSheldrake, P Pharmacologically active compounds US Patent US9334286 Publication Date 5/10/2016
 
Dual specificity protein kinase TTK
Name:Dual specificity protein kinase TTK
Type:Protein
Mol. Mass.:97086.79
Organism:Homo sapiens (Human)
Description:P33981
Residue:857
BDBM230924
NameBDBM230924
Synonyms:US10188642, Example 50 | US9334286, 50
TypeSmall organic molecule
Emp. Form.C28H29FN6O2
Mol. Mass.500.5673
SMILESCOc1c(Nc2cc3cc(ccc3cn2)-c2cnn(CC(C)(C)O)c2)ccc(-c2cnc(C)n2C)c1F