Reaction Details
TargetDual specificity protein kinase TTK
LigandBDBM230930
Substrate/Competitorn/a
Meas. Tech.Kinase Assay
pH7±n/a
Temperature298.15±n/a K
IC50 3±n/a nM
Commentsextracted
Citation Hoelder, SBlagg, JCheung, KJAtrash, BSheldrake, P Pharmacologically active compounds US Patent US9334286 Publication Date 5/10/2016
 
Dual specificity protein kinase TTK
Name:Dual specificity protein kinase TTK
Type:Protein
Mol. Mass.:97086.79
Organism:Homo sapiens (Human)
Description:P33981
Residue:857
BDBM230930
NameBDBM230930
Synonyms:US10188642, Example 56 | US9334286, 56
TypeSmall organic molecule
Emp. Form.C27H29N7O2
Mol. Mass.483.5649
SMILESCOc1nc(ccc1Nc1cc2cc(ccc2cn1)-c1cnn(CC(C)(C)O)c1)-c1cnc(C)n1C