Reaction Details
TargetDual specificity protein kinase TTK
LigandBDBM230965
Substrate/Competitorn/a
Meas. Tech.Kinase Assay
pH7±n/a
Temperature298.15±n/a K
IC50 2±n/a nM
Commentsextracted
Citation Hoelder, SBlagg, JCheung, KJAtrash, BSheldrake, P Pharmacologically active compounds US Patent US9334286 Publication Date 5/10/2016
 
Dual specificity protein kinase TTK
Name:Dual specificity protein kinase TTK
Type:Protein
Mol. Mass.:97086.79
Organism:Homo sapiens (Human)
Description:P33981
Residue:857
BDBM230965
NameBDBM230965
Synonyms:US10188642, Example 91 | US9334286, 91
TypeSmall organic molecule
Emp. Form.C28H29F2N5O4
Mol. Mass.537.5578
SMILESCOC1CN(C1)C(=O)c1ccc(Nc2cc3cc(ccc3cn2)-c2cnn(CC(C)(C)O)c2)c(OC(F)F)c1