Reaction Details
TargetDual specificity protein kinase TTK
LigandBDBM230968
Substrate/Competitorn/a
Meas. Tech.Kinase Assay
pH7±n/a
Temperature298.15±n/a K
IC50 2±n/a nM
Commentsextracted
Citation Hoelder, SBlagg, JCheung, KJAtrash, BSheldrake, P Pharmacologically active compounds US Patent US9334286 Publication Date 5/10/2016
 
Dual specificity protein kinase TTK
Name:Dual specificity protein kinase TTK
Type:Protein
Mol. Mass.:97086.79
Organism:Homo sapiens (Human)
Description:P33981
Residue:857
BDBM230968
NameBDBM230968
Synonyms:US10188642, Example 94 | US9334286, 94
TypeSmall organic molecule
Emp. Form.C30H32N6O3
Mol. Mass.524.6135
SMILESCOc1cc(ccc1Nc1cc2cc(ccc2cn1)-c1cnn(CC(C)(C)O)c1)C(=O)N1CCC(CC1)C#N