Reaction Details
TargetTyrosine-protein kinase BTK
LigandBDBM230099
Substrate/Competitorn/a
Meas. Tech.Btk Enzyme Assay
pH7.4±n/a
Temperature298.15±n/a K
IC50 0.33±n/a nM
Commentsextracted
Citation Batt, DGBertrand, MBDelucca, GGalella, MAKo, SSLangevine, CMLiu, QShi, QSrivastava, ASTino, JAWatterson, SH Substituted tetrahydrocarbazole and carbazole carboxamide compounds US Patent US9334290 Publication Date 5/10/2016
 
Tyrosine-protein kinase BTK
Name:Tyrosine-protein kinase BTK
Type:Enzyme
Mol. Mass.:76289.95
Organism:Homo sapiens (Human)
Description:Q06187
Residue:659
BDBM230099
NameBDBM230099
Synonyms:US10106559, Example 24 US9334290, 23 US9850258, Example 24
TypeSmall organic molecule
Emp. Form.C33H26ClFN4O4
Mol. Mass.597.035
SMILESCc1c(cccc1-n1c(=O)ccn(-c2ccc(F)cc2)c1=O)-c1c(Cl)cc(C(N)=O)c2[nH]c3cc(ccc3c12)C(C)(C)O