Reaction Details
TargetTyrosine-protein kinase BTK
LigandBDBM230119
Substrate/Competitorn/a
Meas. Tech.Btk Enzyme Assay
pH7.4±n/a
Temperature298.15±n/a K
IC50 0.33±n/a nM
Commentsextracted
Citation Batt, DGBertrand, MBDelucca, GGalella, MAKo, SSLangevine, CMLiu, QShi, QSrivastava, ASTino, JAWatterson, SH Substituted tetrahydrocarbazole and carbazole carboxamide compounds US Patent US9334290 Publication Date 5/10/2016
 
Tyrosine-protein kinase BTK
Name:Tyrosine-protein kinase BTK
Type:Enzyme
Mol. Mass.:76289.95
Organism:Homo sapiens (Human)
Description:Q06187
Residue:659
BDBM230119
NameBDBM230119
Synonyms:US9334290, 48
TypeSmall organic molecule
Emp. Form.C31H23ClF2N4O4
Mol. Mass.588.989
SMILESCc1c(cccc1-n1c(=O)[nH]c2c(F)cc(F)cc2c1=O)-c1c(Cl)cc(C(N)=O)c2[nH]c3cc(ccc3c12)C(C)(C)O