Reaction Details
TargetHistone-lysine N-methyltransferase EZH2/Polycomb protein EED/Polycomb protein SUZ12
LigandBDBM291693
Substrate/Competitorn/a
Meas. Tech.ELISA Assay
IC50 2.90±n/a nM
Citation Chan, HMGu, XJHuang, YLi, LMi, YQi, WSendzik, MSun, YWang, LYu, ZZhang, HZhang, JYZhang, MZhang, QZhao, K Triazolopyrimidine compounds and uses thereof US Patent US9580437 Publication Date 2/28/2017
 
Histone-lysine N-methyltransferase EZH2/Polycomb protein EED/Polycomb protein SUZ12
Name:Histone-lysine N-methyltransferase EZH2/Polycomb protein EED/Polycomb protein SUZ12
Type:Protein
Mol. Mass.:n/a
Description:n/a
Components:This complex has 3 components.
Component 1
Name:Polycomb protein EED
Synonyms:EED WAIT-1 hEED
Type:Protein
Mol. Mass.:50201.68
Organism:Homo sapiens (Human)
Description:O75530
Residue:441
Component 2
Name:Histone-lysine N-methyltransferase EZH2
Synonyms:ENX-1 EZH2_HUMAN Histone-lysine N-methyltransferase EZH2 Lysine N-methyltransferase 6
Type:Protein
Mol. Mass.:85367.84
Organism:Homo sapiens (Human)
Description:Q15910
Residue:746
Component 3
Name:Polycomb protein SUZ12
Synonyms:CHET9 Chromatin precipitated E2F target 9 protein Joined to JAZF1 protein Polycomb protein SUZ12 SUZ12 Suppressor of zeste 12 protein homolog
Type:Protein
Mol. Mass.:83080.09
Organism:Homo sapiens (Human)
Description:Q15022
Residue:739
BDBM291693
NameBDBM291693
Synonyms:8-(2-Cyclopropyl-4-methylpyrimidin-5-yl)-N-((5-fluoro-2,3-dihydrobenzofuran-4-yl)methyl)-[1,2,4]triazolo[4,3-c]pyrimidin-5-amine US9580437, Example 8
TypeSmall organic molecule
Emp. Form.C22H20FN7O
Mol. Mass.417.4389
SMILESCc1nc(ncc1-c1cnc(NCc2c3CCOc3ccc2F)n2cnnc12)C1CC1