Reaction Details
TargetNeutrophil elastase
LigandBDBM230371
Substrate/Competitorn/a
Meas. Tech.Human Neutrophil Elastase Assay
pH7.5±n/a
Temperature298.15±n/a K
IC50 3±n/a nM
Commentsextracted
Citation Oost, TFiegen, DGnamm, CHandschuh, SPeters, SRoth, GJ Substituted 4-pyridones and their use as inhibitors of neutrophil elastase activity US Patent US9340507 Publication Date 5/17/2016
 
Neutrophil elastase
Name:Neutrophil elastase
Type:Enzyme
Mol. Mass.:28532.38
Organism:Homo sapiens (Human)
Description:P08246
Residue:267
BDBM230371
NameBDBM230371
Synonyms:US9340507, 29.2
TypeSmall organic molecule
Emp. Form.C26H26F2N2O4S
Mol. Mass.500.557
SMILESCC(C)n1cc(C(=O)NCc2ccc3c(CCS3(=O)=O)c2)c(=O)c(c1C)-c1cccc(c1)C(F)F