Reaction Details
TargetProteinase-activated receptor 1
LigandBDBM230713
Substrate/Competitorn/a
Meas. Tech.FLIPR Assay
IC50 3±n/a nM
Citation Mandal, MBlizzard, TAChen, HChobanian, HGuo, YPio, BWu, ZBiftu, TGreenlee, WJZhu, JZ Preparation and use of bicyclic himbacine derivatives as PAR-1 receptor antagonists US Patent US9340530 Publication Date 5/17/2016
 
Proteinase-activated receptor 1
Name:Proteinase-activated receptor 1
Type:Protein
Mol. Mass.:47450.07
Organism:Homo sapiens (Human)
Description:P25116
Residue:425
BDBM230713
NameBDBM230713
Synonyms:US9340530, 48
TypeSmall organic molecule
Emp. Form.C29H29F2N5O2
Mol. Mass.517.5697
SMILES[H][C@@]12[C@@H](C)OC(=O)[C@@]1(CC(F)(F)[C@@]([H])(C)[C@@H]2\C=C\c1ccc(cn1)-c1ccccc1C#N)NCc1nccn1C