Reaction Details
TargetProteinase-activated receptor 1
LigandBDBM230723
Substrate/Competitorn/a
Meas. Tech.FLIPR Assay
IC50 3±n/a nM
Citation Mandal, MBlizzard, TAChen, HChobanian, HGuo, YPio, BWu, ZBiftu, TGreenlee, WJZhu, JZ Preparation and use of bicyclic himbacine derivatives as PAR-1 receptor antagonists US Patent US9340530 Publication Date 5/17/2016
 
Proteinase-activated receptor 1
Name:Proteinase-activated receptor 1
Type:Protein
Mol. Mass.:47450.07
Organism:Homo sapiens (Human)
Description:P25116
Residue:425
BDBM230723
NameBDBM230723
Synonyms:US9340530, 58
TypeSmall organic molecule
Emp. Form.C31H26F3N3O3
Mol. Mass.545.5516
SMILES[H][C@@]12[C@@H](C)OC(=O)[C@@]1(CC(F)(F)[C@@]([H])(C)[C@@H]2\C=C\c1ccc(cn1)-c1ccccc1C#N)NC(=O)c1cccc(F)c1