Reaction Details
TargetTyrosine-protein kinase ABL1 [64-515]
LigandBDBM230800
Substrate/Competitorn/a
Meas. Tech.Caliper Assay
pH7.5±n/a
Temperature303.15±n/a K
IC50 0.4±n/a nM
Commentsextracted
Citation Furet, PGrotzfeld, RMJahnke, WJones, DBManley, PWMarzinzik, APelle, XFSalem, BSchoepfer, J Benzamide derivatives for inhibiting the activity of ABL1, ABL2 and BCR-ABL1 US Patent US9340537 Publication Date 5/17/2016
 
Tyrosine-protein kinase ABL1 [64-515]
Name:Tyrosine-protein kinase ABL1 [64-515]
Type:Enzyme Catalytic Domain
Mol. Mass.:51539.77
Organism:Homo sapiens (Human)
Description:aa 64-515
Residue:452
BDBM230800
NameBDBM230800
Synonyms:US9340537, 54 | US9896444, Example 54
TypeSmall organic molecule
Emp. Form.C21H19ClF2N6O2
Mol. Mass.460.864
SMILESNC12CC1CN(C2)c1ncc(cc1-c1ccn[nH]1)C(=O)Nc1ccc(OC(F)(F)Cl)cc1