Reaction Details
TargetAurora kinase A
LigandBDBM155569
Substrate/Competitorn/a
Meas. Tech.Kinase Assay
pH7.4±n/a
Temperature298.15±n/a K
IC50 0.4±n/a nM
Commentsextracted
Citation Sugimoto, TTakahashi, HMitsuya, MMasuko, NSootome, H Piperidine compound or salt thereof US Patent US9346787 Publication Date 5/24/2016
 
Aurora kinase A
Name:Aurora kinase A
Type:Serine/threonine-protein kinase
Mol. Mass.:45830.98
Organism:Homo sapiens (Human)
Description:O14965
Residue:403
BDBM155569
NameBDBM155569
Synonyms:US10092556, Example 13 US9346787, 13
TypeSmall organic molecule
Emp. Form.C23H22ClF2N5O3
Mol. Mass.489.902
SMILESCc1cc(Nc2nc(CC3(CCN(CC3)C(=O)c3cccc(Cl)c3F)C(O)=O)ccc2F)n[nH]1