Reaction Details
TargetAldo-keto reductase family 1 member C1
LigandBDBM50427622
Substrate/Competitorn/a
Meas. Tech.Inhibition Assay
IC50 30.71±n/a nM
Citation Marnett, LJLiedtke, AJPenning, TMAdeniji, AOByrns, MC Indomethacin analogs for the treatment of castrate-resistant prostate cancer US Patent US9346803 Publication Date 5/24/2016
 
Aldo-keto reductase family 1 member C1
Name:Aldo-keto reductase family 1 member C1
Type:Enzyme
Mol. Mass.:36793.97
Organism:Homo sapiens (Human)
Description:Recombinant AKR1C1 enzyme was expressed in E. coli.
Residue:323
BDBM50427622
NameBDBM50427622
Synonyms:CHEMBL2323508 | US9346803, Table 2, Compound 10: 3-[1-(4-chlorobenzoyl)-3-ethyl-5-methoxy-1H-indol-2-yl]propanoic acid
TypeSmall organic molecule
Emp. Form.C21H20ClNO4
Mol. Mass.385.841
SMILESCCc1c(CCC(O)=O)n(C(=O)c2ccc(Cl)cc2)c2ccc(OC)cc12