Reaction Details
TargetAldo-keto reductase family 1 member C2
LigandBDBM50427629
Substrate/Competitorn/a
Meas. Tech.Inhibition Assay
IC50 54.5±n/a nM
Citation Marnett, LJLiedtke, AJPenning, TMAdeniji, AOByrns, MC Indomethacin analogs for the treatment of castrate-resistant prostate cancer US Patent US9346803 Publication Date 5/24/2016
 
Aldo-keto reductase family 1 member C2
Name:Aldo-keto reductase family 1 member C2
Type:Enzyme
Mol. Mass.:36739.89
Organism:Homo sapiens (Human)
Description:n/a
Residue:323
BDBM50427629
NameBDBM50427629
Synonyms:CHEMBL179587 | US9346803, Table 2, Compound 7: 2-[5-methoxy-2-methyl-1-(4-methylbenzoyl)-1H-indol-3-yl]acetic acid
TypeSmall organic molecule
Emp. Form.C20H19NO4
Mol. Mass.337.3692
SMILESCOc1ccc2n(C(=O)c3ccc(C)cc3)c(C)c(CC(O)=O)c2c1