Reaction Details
TargetAldo-keto reductase family 1 member C4
LigandBDBM50293598
Substrate/Competitorn/a
Meas. Tech.Inhibition Assay
IC50 48.7±n/a nM
Citation Marnett, LJLiedtke, AJPenning, TMAdeniji, AOByrns, MC Indomethacin analogs for the treatment of castrate-resistant prostate cancer US Patent US9346803 Publication Date 5/24/2016
 
Aldo-keto reductase family 1 member C4
Name:Aldo-keto reductase family 1 member C4
Type:Enzyme
Mol. Mass.:37068.40
Organism:Homo sapiens (Human)
Description:P17516
Residue:323
BDBM50293598
NameBDBM50293598
Synonyms:2'-des-methyl indomethacin US9346803, Des-methylIndomethacin
TypeSmall organic molecule
Emp. Form.C18H14ClNO4
Mol. Mass.343.761
SMILESCOc1ccc2n(cc(CC(O)=O)c2c1)C(=O)c1ccc(Cl)cc1