Reaction Details
TargetAldo-keto reductase family 1 member C4
LigandBDBM50427626
Substrate/Competitorn/a
Meas. Tech.Inhibition Assay
IC50>100±n/a nM
Citation Marnett, LJLiedtke, AJPenning, TMAdeniji, AOByrns, MC Indomethacin analogs for the treatment of castrate-resistant prostate cancer US Patent US9346803 Publication Date 5/24/2016
 
Aldo-keto reductase family 1 member C4
Name:Aldo-keto reductase family 1 member C4
Type:Enzyme
Mol. Mass.:37068.40
Organism:Homo sapiens (Human)
Description:P17516
Residue:323
BDBM50427626
NameBDBM50427626
Synonyms:CHEMBL2323481 | US9346803, Table 2, Compound 5: 2-[1-(4-chlorobenzoyl)-5-methoxy-2-methyl-1H-indol-3-yl]-N-trifluoromethanesulfonylacetamide
TypeSmall organic molecule
Emp. Form.C20H16ClF3N2O5S
Mol. Mass.488.865
SMILESCOc1ccc2n(C(=O)c3ccc(Cl)cc3)c(C)c(CC(=O)NS(=O)(=O)C(F)(F)F)c2c1