Reaction Details
TargetAldo-keto reductase family 1 member C4
LigandBDBM50427624
Substrate/Competitorn/a
Meas. Tech.Inhibition Assay
IC50 3.15±n/a nM
Citation Marnett, LJLiedtke, AJPenning, TMAdeniji, AOByrns, MC Indomethacin analogs for the treatment of castrate-resistant prostate cancer US Patent US9346803 Publication Date 5/24/2016
 
Aldo-keto reductase family 1 member C4
Name:Aldo-keto reductase family 1 member C4
Type:Enzyme
Mol. Mass.:37068.40
Organism:Homo sapiens (Human)
Description:P17516
Residue:323
BDBM50427624
NameBDBM50427624
Synonyms:CHEMBL2323522 | US9346803, Table 2, Compound 11: 9-(4-chlorobenzoyl)-6-methoxy-2,3,4,9-tetrahydro-1H-carbazole-3-carboxylic acid
TypeSmall organic molecule
Emp. Form.C21H18ClNO4
Mol. Mass.383.825
SMILESCOc1ccc2n(C(=O)c3ccc(Cl)cc3)c3CCC(Cc3c2c1)C(O)=O