Reaction Details
TargetAcetylcholinesterase
LigandBDBM231525
Substrate/Competitorn/a
Meas. Tech.In Vitro Pharmacodynamic Assay
IC50 239±n/a nM
Citation Bai, HZhao, XZhong, JGong, YZhu, QLiu, XZheng, XLiu, L Benzodioxole derivative and preparation method and use thereof US Patent US9346818 Publication Date 5/24/2016
 
Acetylcholinesterase
Name:Acetylcholinesterase
Type:Enzyme
Mol. Mass.:68165.65
Organism:Mus musculus (mouse)
Description:n/a
Residue:614
BDBM231525
NameBDBM231525
Synonyms:US9346818, I-10
TypeSmall organic molecule
Emp. Form.C24H27FN2O3
Mol. Mass.410.4812
SMILESCC1N(CCC2CCN(Cc3ccccc3F)CC2)C(=O)c2cc3OCOc3cc12