Reaction Details
TargetSubstance-P receptor
LigandBDBM292014
Substrate/Competitorn/a
Meas. Tech.BCA Protein Assay
pH7.4±n/a
Temperature333.15±n/a K
IC50 2.83±n/a nM
Commentsextracted
Citation Shimizu, KMiyagi, TOhno, KUeno, YOnda, YSuzuki, H Carboxymethyl piperidine derivative US Patent US10100030 Publication Date 10/16/2018
 
Substance-P receptor
Name:Substance-P receptor
Type:G Protein-Coupled Receptor (GPCR)
Mol. Mass.:46254.43
Organism:Homo sapiens (Human)
Description:P25103
Residue:407
BDBM292014
NameBDBM292014
Synonyms:US10100030, Example 9
TypeSmall organic molecule
Emp. Form.C33H34F7N3O3
Mol. Mass.653.6302
SMILESCN(C(=O)C(C)(C)c1cc(cc(c1)C(F)(F)F)C(F)(F)F)c1cnc(cc1-c1ccc(F)cc1C)N1CCC(C)(CC(O)=O)CC1