Reaction Details
TargetSubstance-P receptor
LigandBDBM292016
Substrate/Competitorn/a
Meas. Tech.BCA Protein Assay
pH7.4±n/a
Temperature333.15±n/a K
IC50 1.32±n/a nM
Commentsextracted
Citation Shimizu, KMiyagi, TOhno, KUeno, YOnda, YSuzuki, H Carboxymethyl piperidine derivative US Patent US10100030 Publication Date 10/16/2018
 
Substance-P receptor
Name:Substance-P receptor
Type:G Protein-Coupled Receptor (GPCR)
Mol. Mass.:46254.43
Organism:Homo sapiens (Human)
Description:P25103
Residue:407
BDBM292016
NameBDBM292016
Synonyms:US10100030, Example 11
TypeSmall organic molecule
Emp. Form.C34H33F7N4O3
Mol. Mass.678.6396
SMILESC[C@H](C1CCN(CC1)c1cc(-c2ccc(F)cc2C)c(N(C)C(=O)C(C)(C)c2cc(cc(c2)C(F)(F)F)C(F)(F)F)c(n1)C#N)C(O)=O