Reaction Details
TargetGag-Pol polyprotein
LigandBDBM231619
Substrate/Competitorn/a
Meas. Tech.RNAse H Binding Assay
pH7.8±n/a
Kd 386.5±177.5 nM
Commentsextracted
Citation Beilhartz, GLNgure, MJohns, BADeAnda, FGerondelis, PGötte, M Inhibition of the ribonuclease H activity of HIV-1 reverse transcriptase by GSK5750 correlates with slow enzyme-inhibitor dissociation. J Biol Chem289:16270-7 (2014) 
 
Gag-Pol polyprotein
Name:Gag-Pol polyprotein
Type:Protein
Mol. Mass.:162074.74
Organism:Human immunodeficiency virus type 1 group M subtype B (isolate HXB2)
Description:P04585
Residue:1435
BDBM231619
NameBDBM231619
Synonyms:GSK5750
TypeSmall organic molecule
Emp. Form.C16H12N4O2S
Mol. Mass.324.357
SMILESOn1c2ncccc2c(NCc2cc3ccccc3s2)nc1=O