Reaction Details
TargetEnoyl-[acyl-carrier-protein] reductase [NADH] FabI
LigandBDBM190661
Substrate/Competitorn/a
Meas. Tech.Inhibition Kinetics Assay
pH7.5±n/a
Ki 7.0±0.1 nM
Commentsextracted
Citation Schiebel, JChang, AShah, SLu, YLiu, LPan, PHirschbeck, MWTareilus, MEltschkner, SYu, WCummings, JEKnudson, SEBommineni, GRWalker, SGSlayden, RASotriffer, CATonge, PJKisker, C Rational design of broad spectrum antibacterial activity based on a clinically relevant enoyl-acyl carrier protein (ACP) reductase inhibitor. J Biol Chem289:15987-6005 (2014) 
 
Enoyl-[acyl-carrier-protein] reductase [NADH] FabI
Name:Enoyl-[acyl-carrier-protein] reductase [NADH] FabI
Type:Enzyme
Mol. Mass.:27861.12
Organism:Escherichia coli
Description:n/a
Residue:262
BDBM190661
NameBDBM190661
Synonyms:PT166
TypeSmall organic molecule
Emp. Form.C19H25NO2
Mol. Mass.299.4073
SMILESCCCCCCc1cc(=O)c(Oc2ccccc2C)cn1C