Reaction Details
TargetHistone demethylase UTY [818-1347,P1214I]
LigandBDBM231631
Substrate/Competitorn/a
Meas. Tech.AlphaScreen Assay
pH7.5±n/a
Temperature298.15±n/a K
Kd 3.5e+3± 1.1e+3 nM
Commentsextracted
Citation Walport, LJHopkinson, RJVollmar, MMadden, SKGileadi, COppermann, USchofield, CJJohansson, C Human UTY(KDM6C) is a male-specific N¿-methyl lysyl demethylase. J Biol Chem289:18302-13 (2014) 
 
Histone demethylase UTY [818-1347,P1214I]
Name:Histone demethylase UTY [818-1347,P1214I]
Type:Enzyme
Mol. Mass.:60283.28
Organism:Homo sapiens (Human)
Description:Human UTY(KDM6C) truncation (818-1347 aa) with P1214I mutation
Residue:530
BDBM231631
NameBDBM231631
Synonyms:Biotin-KAPRKQLATKAARKMe3SAPATGG | H3K27Me3 peptide
TypeSmall organic molecule
Emp. Form.C103H183N34O28S
Mol. Mass.2377.831
SMILESCC(C)C[C@H](NC(=O)[C@H](CCC(N)=O)NC(=O)[C@H](CCCCN)NC(=O)[C@H](CCCNC(N)=N)NC(=O)[C@@H]1CCCN1C(=O)[C@H](C)NC(=O)[C@H](CCCCN)NC(=O)CCCC[C@@H]1SC[C@@H]2NC(=O)N[C@H]12)C(=O)N[C@@H](C)C(=O)N[C@@H]([C@@H](C)O)C(=O)N[C@@H](CCCC[N+](C)(C)C)C(=O)N[C@@H](C)C(=O)N[C@@H](C)C(=O)N[C@@H](CCCNC(N)=N)C(=O)N[C@@H](CCCCN)C(=O)N[C@@H](CO)C(=O)N[C@@H](C)C(=O)N1CCC[C@H]1C(=O)N[C@@H](C)C(=O)N[C@@H]([C@@H](C)O)C(=O)NCC(=O)NCC(O)=O