Reaction Details
TargetSodium/potassium-transporting ATPase subunit alpha-2/beta-1
LigandBDBM50286739
Substrate/Competitorn/a
Meas. Tech.Na,K-ATPase Inhibition Assay
Ki 90±14 nM
Citation Katz, ATal, DMHeller, DHaviv, HRabah, BBarkana, YMarcovich, ALKarlish, SJ Digoxin derivatives with enhanced selectivity for the a2 isoform of Na,K-ATPase: effects on intraocular pressure in rabbits. J Biol Chem289:21153-62 (2014) 
 
Sodium/potassium-transporting ATPase subunit alpha-2/beta-1
Name:Sodium/potassium-transporting ATPase subunit alpha-2/beta-1
Type:Protein
Mol. Mass.:n/a
Description:n/a
Components:This complex has 2 components.
Component 1
Name:Sodium/potassium-transporting ATPase subunit alpha-2
Synonyms:AT1A2_HUMAN KIAA0778 | Na,K-ATPase isoform alpha-2 (α2)
Type:Enzyme
Mol. Mass.:112253.12
Organism:Homo sapiens (Human)
Description:P50993
Residue:1020
Component 2
Name:Sodium/potassium-transporting ATPase subunit beta-1
Synonyms:AT1B1_HUMAN ATP1B1 | Na,K-ATPase isoform beta-1 (β1)
Type:Enzyme
Mol. Mass.:35067.44
Organism:Homo sapiens (Human)
Description:P05026
Residue:303
BDBM50286739
NameBDBM50286739
Synonyms:4-((1R,3S,5S,8R,10R,11R,13R,14S,17R)-1,5,11,14-tetrahydroxy-10-(hydroxymethyl)-13-methyl-3-((2R,3R,4R,5R,6S)-3,4,5-trihydroxy-6-methyl-tetrahydro-2H-pyran-2-yloxy)-hexadecahydro-1H-cyclopenta[a]phenanthren-17-yl)furan-2(5H)-one 4-[(1R,3S,5S,10R,11R,13R,14S,17R)-1,5,11,14-Tetrahydroxy-10-hydroxymethyl-13-methyl-3-((2R,3R,4R,5R,6S)-3,4,5-trihydroxy-6-methyl-tetrahydro-pyran-2-yloxy)-hexadecahydro-cyclopenta[a]phenanthren-17-yl]-5H-furan-2-one 4-[1,5,11,14-Tetrahydroxy-10-hydroxymethyl-13-methyl-3-(3,4,5-trihydroxy-6-methyl-tetrahydro-pyran-2-yloxy)-hexadecahydro-cyclopenta[a]phenanthren-17-yl]-5H-furan-2-one CHEMBL222863 Ouabain cid_439501
TypeSmall organic molecule
Emp. Form.C29H44O12
Mol. Mass.584.6525
SMILESC[C@@H]1O[C@@H](O[C@H]2C[C@@H](O)[C@]3(CO)[C@H]4[C@H](O)C[C@]5(C)[C@H](CC[C@]5(O)[C@@H]4CC[C@]3(O)C2)C2=CC(=O)OC2)[C@H](O)[C@H](O)[C@H]1O