Reaction Details
TargetSodium/potassium-transporting ATPase subunit alpha-2/beta-1
LigandBDBM225707
Substrate/Competitorn/a
Meas. Tech.Na,K-ATPase Inhibition Assay
Ki 130±5.5 nM
Citation Katz, ATal, DMHeller, DHaviv, HRabah, BBarkana, YMarcovich, ALKarlish, SJ Digoxin derivatives with enhanced selectivity for the a2 isoform of Na,K-ATPase: effects on intraocular pressure in rabbits. J Biol Chem289:21153-62 (2014) 
 
Sodium/potassium-transporting ATPase subunit alpha-2/beta-1
Name:Sodium/potassium-transporting ATPase subunit alpha-2/beta-1
Type:Protein
Mol. Mass.:n/a
Description:n/a
Components:This complex has 2 components.
Component 1
Name:Sodium/potassium-transporting ATPase subunit alpha-2
Synonyms:AT1A2_HUMAN KIAA0778 | Na,K-ATPase isoform alpha-2 (α2)
Type:Enzyme
Mol. Mass.:112253.12
Organism:Homo sapiens (Human)
Description:P50993
Residue:1020
Component 2
Name:Sodium/potassium-transporting ATPase subunit beta-1
Synonyms:AT1B1_HUMAN ATP1B1 | Na,K-ATPase isoform beta-1 (β1)
Type:Enzyme
Mol. Mass.:35067.44
Organism:Homo sapiens (Human)
Description:P05026
Residue:303
BDBM225707
NameBDBM225707
Synonyms:CS337 | Digoxigenin
TypeSmall Organic Molecule
Emp. Form.C23H34O5
Mol. Mass.390.5131
SMILESC[C@@]12[C@H](CC[C@]1(O)[C@@H]1CC[C@@H]3C[C@@H](O)CC[C@]3(C)[C@H]1C[C@H]2O)C1=CC(=O)OC1