Reaction Details
TargetSodium/potassium-transporting ATPase subunit alpha-2/beta-1
LigandBDBM231658
Substrate/Competitorn/a
Meas. Tech.Na,K-ATPase Inhibition Assay
Ki 47±7.8 nM
Citation Katz, ATal, DMHeller, DHaviv, HRabah, BBarkana, YMarcovich, ALKarlish, SJ Digoxin derivatives with enhanced selectivity for the a2 isoform of Na,K-ATPase: effects on intraocular pressure in rabbits. J Biol Chem289:21153-62 (2014) 
 
Sodium/potassium-transporting ATPase subunit alpha-2/beta-1
Name:Sodium/potassium-transporting ATPase subunit alpha-2/beta-1
Type:Protein
Mol. Mass.:n/a
Description:n/a
Components:This complex has 2 components.
Component 1
Name:Sodium/potassium-transporting ATPase subunit alpha-2
Synonyms:AT1A2_HUMAN KIAA0778 | Na,K-ATPase isoform alpha-2 (α2)
Type:Enzyme
Mol. Mass.:112253.12
Organism:Homo sapiens (Human)
Description:P50993
Residue:1020
Component 2
Name:Sodium/potassium-transporting ATPase subunit beta-1
Synonyms:AT1B1_HUMAN ATP1B1 | Na,K-ATPase isoform beta-1 (β1)
Type:Enzyme
Mol. Mass.:35067.44
Organism:Homo sapiens (Human)
Description:P05026
Residue:303
BDBM231658
NameBDBM231658
Synonyms:DPrN (9)
TypeSmall organic molecule
Emp. Form.C44H70N2O13
Mol. Mass.835.0322
SMILESC[C@@H]1O[C@H](C[C@H](O)[C@@H]1O[C@H]1C[C@H](O)[C@H](OC2CCN(CCC(N)=O)CC(C)O2)[C@H](C)O1)O[C@H]1CC[C@@]2(C)C(CCC3C2C[C@H](O)[C@]2(C)[C@H](CC[C@]32O)C2=CC(=O)OC2)C1