Reaction Details
TargetHeme oxygenase HutZ [D132N]
LigandBDBM231681
Substrate/Competitorn/a
Meas. Tech.Heme Binding Assay
pH8±0
Kd 1.5e+2± 2e+1 nM
Citation Uchida, TDojun, NSekine, YIshimori, K Heme Proximal Hydrogen Bonding between His170 and Asp132 Plays an Essential Role in the Heme Degradation Reaction of HutZ from Vibrio cholerae. Biochemistry56:2723-2734 (2017) 
 
Heme oxygenase HutZ [D132N]
Name:Heme oxygenase HutZ [D132N]
Type:Protein
Mol. Mass.:20294.78
Organism:Vibrio cholerae
Description:V. cholerae HutZ variant D132N
Residue:176
BDBM231681
NameBDBM231681
Synonyms:Hemin
TypeSmall organic molecule
Emp. Form.C34H32N4O4
Mol. Mass.560.6434
SMILESCc1c(CCC(O)=O)c2cc3[n-]c(cc4nc(cc5[n-]c(cc1n2)c(C)c5C=C)c(C)c4C=C)c(C)c3CCC(O)=O