Reaction Details
TargetAlpha-glucosidase MAL32
LigandBDBM23406
Substrate/Competitorn/a
Meas. Tech.α-Glucosidase Inhibition Assay
pH6.8±n/a
Temperature310.15±n/a K
IC50 3.825e+4± 1.2e+2 nM
Commentsextracted
Citation Chaudhry, FChoudhry, SHuma, RAshraf, MAl-Rashida, MMunir, RSohail, RJahan, BMunawar, MAKhan, MA Hetarylcoumarins: Synthesis and biological evaluation as potent a-glucosidase inhibitors. Bioorg Chem73:1-9 (2017) 
 
Alpha-glucosidase MAL32
Name:Alpha-glucosidase MAL32
Type:Enzyme
Mol. Mass.:68132.36
Organism:Saccharomyces cerevisiae (Baker's yeast)
Description:P38158
Residue:584
BDBM23406
NameBDBM23406
Synonyms:(3R,4R,5S,6R)-5-{[(2R,3R,4R,5S,6R)-5-{[(2R,3R,4S,5S,6R)-3,4-dihydroxy-6-methyl-5-{[(1S,4R,5S,6S)-4,5,6-trihydroxy-3-(hydroxymethyl)cyclohex-2-en-1-yl]amino}oxan-2-yl]oxy}-3,4-dihydroxy-6-(hydroxymethyl)oxan-2-yl]oxy}-6-(hydroxymethyl)oxane-2,3,4-triol US11292789, Acarbose
TypeCarbohydrate
Emp. Form.C25H43NO18
Mol. Mass.645.6048
SMILESC[C@H]1O[C@H](O[C@@H]2[C@@H](CO)O[C@H](O[C@@H]3[C@@H](CO)OC(O)[C@H](O)[C@H]3O)[C@H](O)[C@H]2O)[C@H](O)[C@@H](O)[C@@H]1N[C@H]1C=C(CO)[C@@H](O)[C@H](O)[C@H]1O