Reaction Details
TargetSecreted cathepsin L 1
LigandBDBM232209
Substrate/Competitorn/a
Meas. Tech.Cathepsin L Enzyme Assay
IC50 2.94e+4±n/a nM
Citation Moran, BWAnderson, FPRuth, DMFágáin, CODalton, JPKenny, PT Fluorobenzoyl dipeptidyl derivatives as inhibitors of the Fasciola hepatica cysteine protease cathepsin L1. J Enzyme Inhib Med Chem25:1-12 (2010) 
 
Secreted cathepsin L 1
Name:Secreted cathepsin L 1
Type:Protein
Mol. Mass.:36773.95
Organism:Fasciola hepatica (Liver fluke)
Description:n/a
Residue:326
BDBM232209
NameBDBM232209
Synonyms:N-2-fluorobenzoyl-L-leucine-β-alanine benzyl ester (5)
TypeSmall organic molecule
Emp. Form.C22H25FN2O4
Mol. Mass.400.4433
SMILESCC(C)C[C@H](NC(=O)c1ccccc1F)C(=O)NCCC(=O)Oc1ccccc1