Reaction Details
TargetSecreted cathepsin L 1
LigandBDBM232219
Substrate/Competitorn/a
Meas. Tech.Cathepsin L Enzyme Assay
IC50 8.76e+4±n/a nM
Citation Moran, BWAnderson, FPRuth, DMFágáin, CODalton, JPKenny, PT Fluorobenzoyl dipeptidyl derivatives as inhibitors of the Fasciola hepatica cysteine protease cathepsin L1. J Enzyme Inhib Med Chem25:1-12 (2010) 
 
Secreted cathepsin L 1
Name:Secreted cathepsin L 1
Type:Protein
Mol. Mass.:36773.95
Organism:Fasciola hepatica (Liver fluke)
Description:n/a
Residue:326
BDBM232219
NameBDBM232219
Synonyms:N-2-fluorobenzoyl-L-alanine-glycine nitrile (15)
TypeSmall organic molecule
Emp. Form.C12H12FN3O2
Mol. Mass.249.241
SMILESC[C@H](NC(=O)c1ccccc1F)C(=O)NCC#N