Reaction Details
TargetSecreted cathepsin L 1
LigandBDBM232236
Substrate/Competitorn/a
Meas. Tech.Cathepsin L Enzyme Assay
IC50 3.4e+3±n/a nM
Citation Moran, BWAnderson, FPRuth, DMFágáin, CODalton, JPKenny, PT Fluorobenzoyl dipeptidyl derivatives as inhibitors of the Fasciola hepatica cysteine protease cathepsin L1. J Enzyme Inhib Med Chem25:1-12 (2010) 
 
Secreted cathepsin L 1
Name:Secreted cathepsin L 1
Type:Protein
Mol. Mass.:36773.95
Organism:Fasciola hepatica (Liver fluke)
Description:n/a
Residue:326
BDBM232236
NameBDBM232236
Synonyms:N-2,3,4,5-tetrafluorobenzoyl-L-leucine-glycine nitrile (32)
TypeSmall organic molecule
Emp. Form.C15H15F4N3O2
Mol. Mass.345.2921
SMILESCC(C)C[C@H](NC(=O)c1cc(F)c(F)c(F)c1F)C(=O)NCC#N