Reaction Details
TargetSecreted cathepsin L 1
LigandBDBM232241
Substrate/Competitorn/a
Meas. Tech.Cathepsin L Enzyme Assay
IC50 1.00e+4±n/a nM
Citation Moran, BWAnderson, FPRuth, DMFágáin, CODalton, JPKenny, PT Fluorobenzoyl dipeptidyl derivatives as inhibitors of the Fasciola hepatica cysteine protease cathepsin L1. J Enzyme Inhib Med Chem25:1-12 (2010) 
 
Secreted cathepsin L 1
Name:Secreted cathepsin L 1
Type:Protein
Mol. Mass.:36773.95
Organism:Fasciola hepatica (Liver fluke)
Description:n/a
Residue:326
BDBM232241
NameBDBM232241
Synonyms:N-benzoyl-L-leucine-glycine (37)
TypeSmall organic molecule
Emp. Form.C15H20N2O4
Mol. Mass.292.3303
SMILESCC(C)C[C@H](NC(=O)c1ccccc1)C(=O)NCC(O)=O