Reaction Details
TargetCathepsin D
LigandBDBM232264
Substrate/Competitorn/a
Meas. Tech.In-Vitro Fluorescence Assay
pH5.5±n/a
Temperature298.15±n/a K
IC50 27±n/a nM
Commentsextracted
Citation Klein, MTsaklakidis, CGuehring, HLeuthner, B Aminostatin derivatives for the treatment of arthrosis US Patent US9345742 Publication Date 5/24/2016
 
Cathepsin D
Name:Cathepsin D
Type:Enzyme
Mol. Mass.:44551.72
Organism:Homo sapiens (Human)
Description:Human proCathepsin D (SwissProt accession number P07339) was expressed in Sf9 cells, purified, and autoactivated.
Residue:412
BDBM232264
NameBDBM232264
Synonyms:US9345742, 22
TypeSmall organic molecule
Emp. Form.C36H51Cl2N5O7
Mol. Mass.736.725
SMILESCC[C@H](C)[C@H](NC(=O)C[C@H](N)[C@H](Cc1ccccc1)NC(=O)[C@@H](NC(=O)COc1ccc(Cl)cc1Cl)C(C)C)C(=O)N[C@@H](C(C)C)C(=O)OC