Reaction Details
TargetTyrosine-protein kinase JAK1
LigandBDBM232615
Substrate/Competitorn/a
Meas. Tech.JAK Enzyme Assay
pH7.2±n/a
Temperature295.15±n/a K
Ki 1.23±n/a nM
Commentsextracted
Citation Zak, MERay, NCGoodacre, SCMendonca, RKellar, TCheng, YLi, WYuen, P 5-chloro-2-difluoromethoxyphenyl pyrazolopyrimidine compounds, compositions and methods of use thereof US Patent US9346815 Publication Date 5/24/2016
 
Tyrosine-protein kinase JAK1
Name:Tyrosine-protein kinase JAK1
Type:Protein
Mol. Mass.:133293.73
Organism:Homo sapiens (Human)
Description:P23458
Residue:1154
BDBM232615
NameBDBM232615
Synonyms:US9346815, 161 | US9604984, Example 161
TypeSmall organic molecule
Emp. Form.C29H33ClF2N8O4S
Mol. Mass.663.138
SMILESFC(F)Oc1ccc(Cl)cc1-c1nn(cc1NC(=O)c1cnn2cccnc12)C1CCN(CCCN2CCS(=O)(=O)CC2)CC1