Reaction Details
TargetTyrosine-protein kinase JAK1
LigandBDBM232738
Substrate/Competitorn/a
Meas. Tech.JAK Enzyme Assay
pH7.2±n/a
Temperature295.15±n/a K
Ki 0.15±n/a nM
Commentsextracted
Citation Zak, MERay, NCGoodacre, SCMendonca, RKellar, TCheng, YLi, WYuen, P 5-chloro-2-difluoromethoxyphenyl pyrazolopyrimidine compounds, compositions and methods of use thereof US Patent US9346815 Publication Date 5/24/2016
 
Tyrosine-protein kinase JAK1
Name:Tyrosine-protein kinase JAK1
Type:Protein
Mol. Mass.:133293.73
Organism:Homo sapiens (Human)
Description:P23458
Residue:1154
BDBM232738
NameBDBM232738
Synonyms:US9346815, 284 | US9604984, Example 284
TypeSmall organic molecule
Emp. Form.C24H20ClF2N7O3
Mol. Mass.527.911
SMILESFC(F)Oc1ccc(Cl)cc1-c1nn(CC(=O)N2CCC=CC2)cc1NC(=O)c1cnn2cccnc12