Reaction Details
TargetTyrosine-protein kinase JAK2
LigandBDBM232604
Substrate/Competitorn/a
Meas. Tech.JAK Enzyme Assay
pH7.2±n/a
Temperature295.15±n/a K
Ki 0.17±n/a nM
Commentsextracted
Citation Zak, MERay, NCGoodacre, SCMendonca, RKellar, TCheng, YLi, WYuen, P 5-chloro-2-difluoromethoxyphenyl pyrazolopyrimidine compounds, compositions and methods of use thereof US Patent US9346815 Publication Date 5/24/2016
 
Tyrosine-protein kinase JAK2
Name:Tyrosine-protein kinase JAK2
Type:Protein
Mol. Mass.:130684.68
Organism:Homo sapiens (Human)
Description:O60674
Residue:1132
BDBM232604
NameBDBM232604
Synonyms:US9346815, 150
TypeSmall organic molecule
Emp. Form.C27H32ClF2N9O3
Mol. Mass.604.051
SMILESCC(=O)NCCCN1CCC(CC1)n1cc(NC(=O)C(\C(N)=N)=C2\NC=CC=N2)c(n1)-c1cc(Cl)ccc1OC(F)F