Reaction Details
TargetTyrosine-protein kinase JAK2
LigandBDBM232631
Substrate/Competitorn/a
Meas. Tech.JAK Enzyme Assay
pH7.2±n/a
Temperature295.15±n/a K
Ki 0.09±n/a nM
Commentsextracted
Citation Zak, MERay, NCGoodacre, SCMendonca, RKellar, TCheng, YLi, WYuen, P 5-chloro-2-difluoromethoxyphenyl pyrazolopyrimidine compounds, compositions and methods of use thereof US Patent US9346815 Publication Date 5/24/2016
 
Tyrosine-protein kinase JAK2
Name:Tyrosine-protein kinase JAK2
Type:Protein
Mol. Mass.:130684.68
Organism:Homo sapiens (Human)
Description:O60674
Residue:1132
BDBM232631
NameBDBM232631
Synonyms:US9346815, 177 | US9604984, Example 177
TypeSmall organic molecule
Emp. Form.C26H29ClF2N8O4S
Mol. Mass.623.074
SMILESCS(=O)(=O)CCCN1CCC(CC1)n1cc(NC(=O)c2c(N)nn3cccnc23)c(n1)-c1cc(Cl)ccc1OC(F)F