Reaction Details
TargetTyrosine-protein kinase JAK2
LigandBDBM232730
Substrate/Competitorn/a
Meas. Tech.JAK Enzyme Assay
pH7.2±n/a
Temperature295.15±n/a K
Ki 0.18±n/a nM
Commentsextracted
Citation Zak, MERay, NCGoodacre, SCMendonca, RKellar, TCheng, YLi, WYuen, P 5-chloro-2-difluoromethoxyphenyl pyrazolopyrimidine compounds, compositions and methods of use thereof US Patent US9346815 Publication Date 5/24/2016
 
Tyrosine-protein kinase JAK2
Name:Tyrosine-protein kinase JAK2
Type:Protein
Mol. Mass.:130684.68
Organism:Homo sapiens (Human)
Description:O60674
Residue:1132
BDBM232730
NameBDBM232730
Synonyms:US9346815, 276 | US9604984, Example 276
TypeSmall organic molecule
Emp. Form.C29H25ClF2N8O4
Mol. Mass.623.01
SMILESOC1(CCN(CC1)C(=O)Cn1cc(NC(=O)c2cnn3cccnc23)c(n1)-c1cc(Cl)ccc1OC(F)F)c1ccncc1