Reaction Details
TargetTyrosine-protein kinase JAK2
LigandBDBM232736
Substrate/Competitorn/a
Meas. Tech.JAK Enzyme Assay
pH7.2±n/a
Temperature295.15±n/a K
Ki 0.12±n/a nM
Commentsextracted
Citation Zak, MERay, NCGoodacre, SCMendonca, RKellar, TCheng, YLi, WYuen, P 5-chloro-2-difluoromethoxyphenyl pyrazolopyrimidine compounds, compositions and methods of use thereof US Patent US9346815 Publication Date 5/24/2016
 
Tyrosine-protein kinase JAK2
Name:Tyrosine-protein kinase JAK2
Type:Protein
Mol. Mass.:130684.68
Organism:Homo sapiens (Human)
Description:O60674
Residue:1132
BDBM232736
NameBDBM232736
Synonyms:US9346815, 282 | US9604984, Example 282
TypeSmall organic molecule
Emp. Form.C23H19ClF4N8O3
Mol. Mass.566.895
SMILESNc1nn2cccnc2c1C(=O)Nc1cn(CC(=O)N2CCC(F)(F)C2)nc1-c1cc(Cl)ccc1OC(F)F