Reaction Details
TargetVoltage-dependent calcium channel gamma-2 subunit
LigandBDBM292054
Substrate/Competitorn/a
Meas. Tech.Biological Assays Calcium Flux Assay
pH7.4±n/a
IC50 0.050±n/a nM
Commentsextracted
Citation Ameriks, MKLaforteza, BNSavall, BMWade, WSMeyer, STGyuris, M 3-aryl-2H-pyrazolo[4,3-b]pyridine compounds and their use as AMPA receptor modulators US Patent US10100045 Publication Date 10/16/2018
 
Voltage-dependent calcium channel gamma-2 subunit
Name:Voltage-dependent calcium channel gamma-2 subunit
Type:Enzyme Catalytic Domain
Mol. Mass.:35977.54
Organism:Homo sapiens (Human)
Description:n/a
Residue:323
BDBM292054
NameBDBM292054
Synonyms:5-(2-Cyclobutyl-5-(trifluoromethyl)-2H-pyrazolo[4,3-b]pyridin-3-yl)-7- | US10100045, Example 25
TypeSmall organic molecule
Emp. Form.C20H17F3N4O
Mol. Mass.386.3704
SMILESCc1cc(cc2CC(=O)Nc12)-c1n(nc2ccc(nc12)C(F)(F)F)C1CCC1